1. You want that $100.00 in your pocket or an Amazon Fire TV don't you? Well here's the deal. With our new updated look we are in desperate need of an updated logo. The 'old' one has certainly served us well, but it's time. Find all the details here: bit.ly/1q0k6Wa
  2. DroidForums.net is currently undergoing a major software upgrade. If you are experiencing any problems logging in please: Contact Us

Droid RAZR HD Update Fails

Discussion in 'Rescue Squad Help' started by JTruj1ll0923, Nov 19, 2013.

  1. JTruj1ll0923
    Offline

    JTruj1ll0923 New Member

    Joined:
    Nov 19, 2013
    Messages:
    1
    Likes Received:
    0
    Trophy Points:
    0
    So for the past few days, I have been trying to update OTA my Droid RAZR HD to 9.18.94 from 9.18.79 and it always fails a quarter of the way through. I found the OTA snatcher and OTA verifier on Google play and used those to get the below errors. If you could please help me figure out what all this means and how I could fix it I would really appreciate it!

    ==================
    Detailed Analysis
    ==================

    - you have no frozen system apps (good!)

    - there were 20 failed expressions; see below for the details about these tests that will cause your OTA install to fail

    - there were no bypassed expressions (good!)
    -------------------------------
    statistics:

    frozen system apps: 0
    success count: 438
    fail count: 20
    ignore count: 1298
    partition count: 0
    protected count: 19
    bypassed count: 0

    Device information:

    Device: vanquish
    Maker: motorola
    Model: DROID RAZR HD
    Carrier: Verizon Wireless
    Board: MSM8960
    Name: XT926_verizon
    Bootloader: 0x109B
    Android OS: 4.1.2

    -------------------------------
    updater-script analysis details:

    FAILED: line #824:

    assert(apply_patch_check("EMMC:boot:10485760:a1c699a6a7d07d1859b704359bd79f0e5eb65ab8:10485760:9b13358606bc93350c0ec2feef5c9cfa9a30dee9"));

    apply_patch_check: file (boot) does not exist or cannot be accessed

    ----------------------
    FAILED: line #828:

    assert(apply_patch_check("/modem/image/dsps.b01", "bf66bb5baa2113e35c766e77015f902b2fce9e1c", "3714d02951c6a28c4e56dba16a694904f4f073d7"));

    [the SHA1 checksum for file /modem/image/dsps.b01 (da39a3ee5e6b4b0d3255bfef95601890afd80709) does not match any SHA1 in the above expression]

    ----------------------
    FAILED: line #829:

    assert(apply_patch_check("/modem/image/dsps.b02", "73938583dd58252dd47fefadf6e21e459d9a6053", "4bf50ff5a33eb36fbf150ac124da0613b616ad8d"));

    [the SHA1 checksum for file /modem/image/dsps.b02 (da39a3ee5e6b4b0d3255bfef95601890afd80709) does not match any SHA1 in the above expression]

    ----------------------
    FAILED: line #830:

    assert(apply_patch_check("/modem/image/dsps.b03", "0cfe54fc9a4fa49eec1ebd1de492b9f946a23838", "6fabb26ac9e913ce95d41aa75027dc1dc3a37767"));

    [the SHA1 checksum for file /modem/image/dsps.b03 (da39a3ee5e6b4b0d3255bfef95601890afd80709) does not match any SHA1 in the above expression]

    ----------------------
    FAILED: line #831:

    assert(apply_patch_check("/modem/image/dsps.b04", "df5566ee986b9b6ad67a82f5f270ccca93b575a6", "bbd6779e90e82ab003f36ea9fe6c763cb1864f57"));

    [the SHA1 checksum for file /modem/image/dsps.b04 (da39a3ee5e6b4b0d3255bfef95601890afd80709) does not match any SHA1 in the above expression]

    ----------------------
    FAILED: line #832:

    assert(apply_patch_check("/modem/image/dsps.b05", "f460f9c6185f536dd27e4f34ca064a462875615a", "89eb6597fafe4beecf78ca637426b1dc2a44a133"));

    [the SHA1 checksum for file /modem/image/dsps.b05 (da39a3ee5e6b4b0d3255bfef95601890afd80709) does not match any SHA1 in the above expression]

    ----------------------
    FAILED: line #833:

    assert(apply_patch_check("/modem/image/dsps.mdt", "f7a1c10add83dbe2799d0880c2a899b31c85873f", "75dc508c4a005e360f83640872df0c2b10647779"));

    [the SHA1 checksum for file /modem/image/dsps.mdt (da39a3ee5e6b4b0d3255bfef95601890afd80709) does not match any SHA1 in the above expression]

    ----------------------
    FAILED: line #834:

    assert(apply_patch_check("/modem/image/modem.b00", "270e3671205262eb4b008b4287d513e4358afde4", "c73f86f085611a09dfe817a8816625d27aa8c32f"));

    [the SHA1 checksum for file /modem/image/modem.b00 (da39a3ee5e6b4b0d3255bfef95601890afd80709) does not match any SHA1 in the above expression]

    ----------------------
    FAILED: line #835:

    assert(apply_patch_check("/modem/image/modem.b01", "14561aaea1ae8e5ceb7358aa48791d4978a46617", "b6e84b09477642b69b6b38b840bf5d29f3ddb2cd"));

    [the SHA1 checksum for file /modem/image/modem.b01 (da39a3ee5e6b4b0d3255bfef95601890afd80709) does not match any SHA1 in the above expression]

    ----------------------
    FAILED: line #836:

    assert(apply_patch_check("/modem/image/modem.b02", "39374c28e08bf422bc90b4f79230ad158c940331", "10c24af23277f8c40957bb7acc724ba56cbf0936"));

    [the SHA1 checksum for file /modem/image/modem.b02 (da39a3ee5e6b4b0d3255bfef95601890afd80709) does not match any SHA1 in the above expression]

    ----------------------
    FAILED: line #837:

    assert(apply_patch_check("/modem/image/modem.b03", "6499588dc2fde2b25926d4df0a1a2f44cacad6bc", "1d72e67446a0ed2e2b100d8054db37301973102f"));

    [the SHA1 checksum for file /modem/image/modem.b03 (da39a3ee5e6b4b0d3255bfef95601890afd80709) does not match any SHA1 in the above expression]

    ----------------------
    FAILED: line #838:

    assert(apply_patch_check("/modem/image/modem.b04", "4eb9326de549383d540d6c0123551ca9d97225ab", "172db7540a6f83aa1c75c220a0a47947a6441cee"));

    [the SHA1 checksum for file /modem/image/modem.b04 (da39a3ee5e6b4b0d3255bfef95601890afd80709) does not match any SHA1 in the above expression]

    ----------------------
    FAILED: line #839:

    assert(apply_patch_check("/modem/image/modem.b06", "6e69f8491880c60003bbd7af885082c0c6ac1a7a", "e41177a041adbf4712fa347e6a0c9bd24a3bb326"));

    [the SHA1 checksum for file /modem/image/modem.b06 (da39a3ee5e6b4b0d3255bfef95601890afd80709) does not match any SHA1 in the above expression]

    ----------------------
    FAILED: line #840:

    assert(apply_patch_check("/modem/image/modem.b07", "2e46f892fd7505e6cc5e57e9e9730974e5b14f0e", "052c90bbd395f2f08f87c72b0e1fa157d4888887"));

    [the SHA1 checksum for file /modem/image/modem.b07 (da39a3ee5e6b4b0d3255bfef95601890afd80709) does not match any SHA1 in the above expression]

    ----------------------
    FAILED: line #841:

    assert(apply_patch_check("/modem/image/modem.mdt", "6a343cdaa74c94fdcb39eae8663ee2370d0bf47d", "079cea13a4c450fc785dbe3623149e8e3b63b6d3"));

    [the SHA1 checksum for file /modem/image/modem.mdt (da39a3ee5e6b4b0d3255bfef95601890afd80709) does not match any SHA1 in the above expression]

    ----------------------
    FAILED: line #842:

    assert(apply_patch_check("/modem/image/wcnss.b00", "34659608442518a7805865e5a60721f6982f666c", "e897f83e262ecd0606c10ea61c1e751d1e2e1d49"));

    [the SHA1 checksum for file /modem/image/wcnss.b00 (da39a3ee5e6b4b0d3255bfef95601890afd80709) does not match any SHA1 in the above expression]

    ----------------------
    FAILED: line #843:

    assert(apply_patch_check("/modem/image/wcnss.b01", "9e2a4f467f1d43653b103d86e217af2137256a27", "590b0b0766a6dce4cdb6da036517a010874e1452"));

    [the SHA1 checksum for file /modem/image/wcnss.b01 (da39a3ee5e6b4b0d3255bfef95601890afd80709) does not match any SHA1 in the above expression]

    ----------------------
    FAILED: line #844:

    assert(apply_patch_check("/modem/image/wcnss.b02", "eb33e3c1d0866d0e7e5398666ae7d113ce43958f", "ec801e6bb0109067abe42dbd6a301c3280f95cef"));

    [the SHA1 checksum for file /modem/image/wcnss.b02 (da39a3ee5e6b4b0d3255bfef95601890afd80709) does not match any SHA1 in the above expression]

    ----------------------
    FAILED: line #845:

    assert(apply_patch_check("/modem/image/wcnss.b04", "b5c003b07b62472b655e041b196c92a6747d68b8", "09c8983372671fddc7423d7e1867daa61f248a83"));

    [the SHA1 checksum for file /modem/image/wcnss.b04 (da39a3ee5e6b4b0d3255bfef95601890afd80709) does not match any SHA1 in the above expression]

    ----------------------
    FAILED: line #846:

    assert(apply_patch_check("/modem/image/wcnss.mdt", "5bec4d9ac4034e3b2c3d4bac3f55d40d04eb3541", "b388a0f4bb9f83a32036cf330a83595b520968e3"));

    [the SHA1 checksum for file /modem/image/wcnss.mdt (da39a3ee5e6b4b0d3255bfef95601890afd80709) does not match any SHA1 in the above expression]
  2. jimmyv
    Offline

    jimmyv New Member

    Joined:
    Nov 15, 2013
    Messages:
    4
    Likes Received:
    0
    Trophy Points:
    0
    My update keeps failing as well. Did you ever resolve this? If so, how?
Search tags for this page

9.18.79 update failed

,
android update always fails
,
droid hd update failed
,
droid razr maxx hd ota fails
,
droid razr maxx hd ota update failure
,
droid x hd update fail
,
failed modem/dsps
,

modem.b00 droid

,
motorola razr hd mta fail to install
,
new 2014 motorola razr update fail
,
razr hd failed update
,

razr hd update failed

,
razr hd will not update
,
razr update fail
,
update failed razr hd